Home > Dpkg Error > Dpkg Error

Dpkg Error

Contents

share|improve this answer answered Jan 5 at 20:41 user489207 12 add a comment| Your Answer draft saved draft discarded Sign up or log in Sign up using Google Sign up Mining for 5 days at an avg of 19 Mh/s but not a single cent, is this normal? Do "accountable", "responsible", "answerable" imply "blamable"? more stack exchange communities company blog Stack Exchange Inbox Reputation and Badges sign up log in tour help Tour Start here for a quick overview of the site Help Center Detailed click site

Need to get 0 B/2,875 kB of archives. anything is possible, make it happen! I am getting a white screen now. http://www.techmindz.com Deepak Mittal As far as my know, Cydia has something to do with iPhone.

Dpkg Error Code 1

Share your knowledge. Is it permitted to not take Ph.D. Any other suggestion/ solution will be appreciated..

subprocess installed post-installation script returned error exit status 100: this tells me that the script that failed was the postinst, the one executed in post-installation. APT attempts to install & start Jenkins before the installation of openjdk-7-jre-headless. On my end I am still using the version that ships with Ubuntu 14.04. Dpkg Error Processing Package Mysql-server-5.5 (--configure) It worked for me. 0 hdiario July 16, 2015 Thank you CrypticDesigns.

more stack exchange communities company blog Stack Exchange Inbox Reputation and Badges sign up log in tour help Tour Start here for a quick overview of the site Help Center Detailed Dpkg Error Need An Action Option Is it permitted to not take Ph.D. dpkg: error processing linux-image-extra-3.11.0-12-generic (--remove): subprocess installed post-removal script returned error exit status 1 Removing linux-image-3.11.0-12-generic ... Join them; it only takes a minute: Sign up Here's how it works: Anybody can ask a question Anybody can answer The best answers are voted up and rise to the

I accidentally closed the terminal before it was finished and now I can't install or update any program on my machine. Dpkg Error Processing Package Mysql-server (--configure) Can I restore my wallet with the mnemonic seed even if the seed words are changed in the future? Pingback: Ubuntu:How to resolve “dpkg: error processing /var/cache/apt/archives/python-apport_2.0.1-0ubuntu9_all.deb”? - Ubuntu Linux Questions() Pratik Somaiya Thank You so much 🙂 = © 2009-2016 Deepak Mittal - Absolutely Tech • Powered By depmod....

Dpkg Error Need An Action Option

Done Building dependency tree Reading state information... It seems get_running is returning an exit code of 2, which in turn causes the init script to exit 7. Dpkg Error Code 1 Beans 84 DistroUbuntu 12.04 Precise Pangolin Re: E: Sub-process /usr/bin/dpkg returned an error code (1) Thank you so much sikander3786. Dpkg Error Processing Package Teamviewer (--install) My home PC has been infected by a virus!

Examining /etc/kernel/postrm.d . get redirected here run-parts: executing /etc/kernel/postrm.d/initramfs-tools 3.11.0-12-generic /boot/vmlinuz-3.11.0-12-generic update-initramfs: Deleting /boot/initrd.img-3.11.0-12-generic run-parts: executing /etc/kernel/postrm.d/zz-update-grub 3.11.0-12-generic /boot/vmlinuz-3.11.0-12-generic /usr/sbin/grub-mkconfig: 35: /etc/default/grub: Syntax error: EOF in backquote substitution run-parts: /etc/kernel/postrm.d/zz-update-grub exited with return code 2 Failed to dpkg: error processing mysql-server-5.1 (--configure): subprocess installed post-installation script returned error exit status 1 dpkg: dependency problems prevent configuration of mysql-server: mysql-server depends on mysql-server-5.1; however: Package mysql-server-5.1 is not configured Join Date May 2010 Location uk Beans 9,374 DistroXubuntu 14.04 Trusty Tahr Re: E: Sub-process /usr/bin/dpkg returned an error code (1) Hi Try this. Dpkg Error Processing Package Mysql-server-5.6 (--configure)

Why aren't Muggles extinct? run-parts: executing /etc/kernel/prerm.d/dkms 3.11.0-12-generic /boot/vmlinuz-3.11.0-12-generic dkms: removing: bbswitch 0.7 (3.11.0-12-generic) (i686) -------- Uninstall Beginning -------- Module: bbswitch Version: 0.7 Kernel: 3.11.0-12-generic (i686) ------------------------------------- Status: Before uninstall, this module version was ACTIVE How does an exponent work when it's less than one? navigate to this website However output below; First command & second got this output: Code: [email protected]:~$ sudo dpkg --configure -a Setting up getdeb-repository (0.1-1~getdeb1) ... --2010-12-10 16:14:19-- http://archive.getdeb.net/getdeb-archive.key Resolving archive.getdeb.net...

Retrieving values() from a Map of Sets in SOQL query Why are so many metros underground? Dpkg Error Requested Operation Requires Superuser Privilege Cheers! Tango Icons Tango Desktop Project.

Reply Log In to Comment Have another answer?

As it is, to solve the problem, that line is worthless. –Braiam Mar 22 '15 at 18:03 My bad I thought you were just looking for how to fix dpkg: error processing linux-image-3.11.0-12-generic (--purge): subprocess installed post-removal script returned error exit status 1 Errors were encountered while processing: linux-image-3.11.0-12-generic I then ran sudo apt-get install -f and got output Reading I'm stuck at this point as nothing I can find on Google helps. Dpkg Error Processing Archive Not the answer you're looking for?

Check the paths! The problem is in the config files. Here's a diff of the two init scripts. $ diff ~/jenkins.1.639.sh ~/jenkins.1.635.sh 183,194d182 < # Verify the process did in fact start successfully and didn't just bomb out < do_check_started_ok() { my review here TIA Code: Setting up getdeb-repository (0.1-1~getdeb1) ... --2010-12-10 14:35:00-- http://archive.getdeb.net/getdeb-archive.key Resolving archive.getdeb.net...

Should I serve jury duty when I have no respect for the judge? failed: Name or service not known. UNIX is a registered trademark of The Open Group. Hope this will work, please give a report.

Join Date Apr 2009 Location Rawalpindi, Pakistan Beans 5,666 DistroUbuntu Gnome Development Release Re: E: Sub-process /usr/bin/dpkg returned an error code (1) Originally Posted by neehs Thank you so much sikander3786. Unpacking nginx (1.8.0-1~trusty) over (1.4.6-1ubuntu3.3) ... Is there a workaround to install Jenkins on Ubuntu 14.04? Hide Permalink Trevor Jones added a comment - 2016/Mar/10 7:43 PM Jenkins now appears to require java 7.

Can we say "He is accountable but not blamable" ? APT attempts to install & start Jenkins before the installation of openjdk-7-jre-headless. dpkg: error processing package mysql-server (--configure): dependency problems - leaving unconfigured No apport report written because the error message indicates its a followup error from a previous failure. If I am fat and unattractive, is it better to opt for a phone interview over a Skype interview?

Browse other questions tagged command-line apt package-management dpkg vnc or ask your own question. asked 2 years ago viewed 15427 times active 4 days ago Related 2dpkg Unmet dependency linux-image-generic 13.100partial upgrade1Error installing or updating due to dpkg and linux-image-extra-3.11.0-15-generic2DPKG: Error Processing (--unpack) (RaspberryPi Compiler Done Correcting dependencies...